Reaction Details
TargetHomeodomain-interacting protein kinase 2
LigandBDBM31085
Substrate/Competitorn/a
Meas. Tech.ChEMBL_774609 (CHEMBL1908826)
Kd 7.3±n/a nM
Citation Davis, MIHunt, JPHerrgard, SCiceri, PWodicka, LMPallares, GHocker, MTreiber, DKZarrinkar, PP Comprehensive analysis of kinase inhibitor selectivity. Nat Biotechnol29:1046-51 (2011) 
 
Homeodomain-interacting protein kinase 2
Name:Homeodomain-interacting protein kinase 2
Type:Protein
Mol. Mass.:131001.90
Organism:Homo sapiens (Human)
Description:Q9H2X6
Residue:1198
BDBM31085
NameBDBM31085
Synonyms:1-[4-[(4-ethyl-1-piperazinyl)methyl]-3-(trifluoromethyl)phenyl]-3-[4-[[6-(methylamino)-4-pyrimidinyl]oxy]phenyl]urea 1-[4-[(4-ethylpiperazino)methyl]-3-(trifluoromethyl)phenyl]-3-[4-[6-(methylamino)pyrimidin-4-yl]oxyphenyl]urea cid_11409972
TypeSmall organic molecule
Emp. Form.C26H30F3N7O2
Mol. Mass.529.5573
SMILESCCN1CCN(Cc2ccc(NC(=O)Nc3ccc(Oc4cc(NC)ncn4)cc3)cc2C(F)(F)F)CC1