Reaction Details
TargetSerine/threonine-protein kinase N1
LigandBDBM15138
Substrate/Competitorn/a
Meas. Tech.ChEMBL_774225 (CHEMBL1908442)
Kd 210±n/a nM
Citation Davis, MIHunt, JPHerrgard, SCiceri, PWodicka, LMPallares, GHocker, MTreiber, DKZarrinkar, PP Comprehensive analysis of kinase inhibitor selectivity. Nat Biotechnol29:1046-51 (2011) 
 
Serine/threonine-protein kinase N1
Name:Serine/threonine-protein kinase N1
Type:PROTEIN
Mol. Mass.:103928.39
Organism:Homo sapiens (Human)
Description:ChEMBL_1433150
Residue:942
BDBM15138
NameBDBM15138
Synonyms:5-indazolyl pyridine 11g A-674563 indazole-pyridine, 7
TypeSmall organic molecule
Emp. Form.C22H22N4O
Mol. Mass.358.4363
SMILESCc1n[nH]c2ccc(cc12)-c1cncc(OC[C@@H](N)Cc2ccccc2)c1