Reaction Details
TargetDual specificity mitogen-activated protein kinase kinase 7
LigandBDBM21
Substrate/Competitorn/a
Meas. Tech.ChEMBL_774202 (CHEMBL1908419)
Kd>10000±n/a nM
Citation Davis, MIHunt, JPHerrgard, SCiceri, PWodicka, LMPallares, GHocker, MTreiber, DKZarrinkar, PP Comprehensive analysis of kinase inhibitor selectivity. Nat Biotechnol29:1046-51 (2011) 
 
Dual specificity mitogen-activated protein kinase kinase 7
Name:Dual specificity mitogen-activated protein kinase kinase 7
Type:Protein
Mol. Mass.:47502.52
Organism:Homo sapiens (Human)
Description:O14733
Residue:419
BDBM21
NameBDBM21
Synonyms:CHEMBL24828 VANDETANIB ZD6474 | cid_3081361
Typen/a
Emp. Form.C22H24BrFN4O2
Mol. Mass.475.354
SMILESCOc1cc2c(Nc3ccc(Br)cc3F)ncnc2cc1OCC1CCN(C)CC1