Reaction Details
TargetCyclin-dependent kinase 17
LigandBDBM5931
Substrate/Competitorn/a
Meas. Tech.ChEMBL_774256 (CHEMBL1908473)
Kd 13±n/a nM
Citation Davis, MIHunt, JPHerrgard, SCiceri, PWodicka, LMPallares, GHocker, MTreiber, DKZarrinkar, PP Comprehensive analysis of kinase inhibitor selectivity. Nat Biotechnol29:1046-51 (2011) 
 
Cyclin-dependent kinase 17
Name:Cyclin-dependent kinase 17
Type:PROTEIN
Mol. Mass.:59600.69
Organism:Homo sapiens (Human)
Description:ChEMBL_586854
Residue:523
BDBM5931
NameBDBM5931
Synonyms:BMS-387072 N-(5-{[(5-tert-butyl-1,3-oxazol-2-yl)methyl]sulfanyl}-1,3-thiazol-2-yl)piperidine-4-carboxamide cid_3025986
TypeSmall organic molecule
Emp. Form.C17H24N4O2S2
Mol. Mass.380.528
SMILESCC(C)(C)c1cnc(CSc2cnc(NC(=O)C3CCNCC3)s2)o1