Reaction Details
TargetSTE20-like serine/threonine-protein kinase
LigandBDBM50355496
Substrate/Competitorn/a
Meas. Tech.ChEMBL_774566 (CHEMBL1908783)
Kd 13±n/a nM
Citation Davis, MIHunt, JPHerrgard, SCiceri, PWodicka, LMPallares, GHocker, MTreiber, DKZarrinkar, PP Comprehensive analysis of kinase inhibitor selectivity. Nat Biotechnol29:1046-51 (2011) 
 
STE20-like serine/threonine-protein kinase
Name:STE20-like serine/threonine-protein kinase
Type:PROTEIN
Mol. Mass.:142644.38
Organism:Homo sapiens (Human)
Description:ChEMBL_1451342
Residue:1235
BDBM50355496
NameBDBM50355496
Synonyms:CHEMBL1908397
TypeSmall organic molecule
Emp. Form.C20H20N4O
Mol. Mass.332.399
SMILESO=C(N1CCNCC1)c1ccc(\C=C\c2n[nH]c3ccccc23)cc1