Reaction Details
TargetBMP-2-inducible protein kinase
LigandBDBM50355496
Substrate/Competitorn/a
Meas. Tech.ChEMBL_774589 (CHEMBL1908806)
Kd 9.6±n/a nM
Citation Davis, MIHunt, JPHerrgard, SCiceri, PWodicka, LMPallares, GHocker, MTreiber, DKZarrinkar, PP Comprehensive analysis of kinase inhibitor selectivity. Nat Biotechnol29:1046-51 (2011) 
 
BMP-2-inducible protein kinase
Name:BMP-2-inducible protein kinase
Type:PROTEIN
Mol. Mass.:129169.50
Organism:Homo sapiens (Human)
Description:ChEMBL_774589
Residue:1161
BDBM50355496
NameBDBM50355496
Synonyms:CHEMBL1908397
TypeSmall organic molecule
Emp. Form.C20H20N4O
Mol. Mass.332.399
SMILESO=C(N1CCNCC1)c1ccc(\C=C\c2n[nH]c3ccccc23)cc1