Reaction Details
TargetFibroblast growth factor receptor 2
LigandBDBM50355496
Substrate/Competitorn/a
Meas. Tech.ChEMBL_774611 (CHEMBL1908828)
Kd 850±n/a nM
Citation Davis, MIHunt, JPHerrgard, SCiceri, PWodicka, LMPallares, GHocker, MTreiber, DKZarrinkar, PP Comprehensive analysis of kinase inhibitor selectivity. Nat Biotechnol29:1046-51 (2011) 
 
Fibroblast growth factor receptor 2
Name:Fibroblast growth factor receptor 2
Type:Enzyme
Mol. Mass.:92015.45
Organism:Homo sapiens (Human)
Description:P21802
Residue:821
BDBM50355496
NameBDBM50355496
Synonyms:CHEMBL1908397
TypeSmall organic molecule
Emp. Form.C20H20N4O
Mol. Mass.332.399
SMILESO=C(N1CCNCC1)c1ccc(\C=C\c2n[nH]c3ccccc23)cc1