Reaction Details
TargetSerine/threonine-protein kinase SIK3 [59-1321]
LigandBDBM5445
Substrate/Competitorn/a
Meas. Tech.ChEMBL_774254 (CHEMBL1908471)
Kd>10000±n/a nM
Citation Davis, MIHunt, JPHerrgard, SCiceri, PWodicka, LMPallares, GHocker, MTreiber, DKZarrinkar, PP Comprehensive analysis of kinase inhibitor selectivity. Nat Biotechnol29:1046-51 (2011) 
 
Serine/threonine-protein kinase SIK3 [59-1321]
Name:Serine/threonine-protein kinase SIK3 [59-1321]
Type:PROTEIN
Mol. Mass.:139984.87
Organism:Homo sapiens (Human)
Description:ChEMBL_774254
Residue:1263
BDBM5445
NameBDBM5445
Synonyms:CHEMBL554 LAPATINIB DITOSYLATE N-{3-chloro-4-[(3-fluoro-benzyl)oxy]phenyl}-6-[5-({2-(methylsulfonyl)ethyl]amino}methyl)-2-furyl]-4-quinazolinamine Tykerb US10822334, Compound Lapatinib cid_208908
TypeSmall organic molecule
Emp. Form.C29H26ClFN4O4S
Mol. Mass.581.058
SMILESCS(=O)(=O)CCNCc1ccc(o1)-c1ccc2ncnc(Nc3ccc(OCc4cccc(F)c4)c(Cl)c3)c2c1