Reaction Details
TargetAcetylcholinesterase
LigandBDBM50355820
Substrate/Competitorn/a
Meas. Tech.ChEMBL_775052 (CHEMBL1912247)
IC50 0.4710±n/a nM
Citation Rosini, MSimoni, EBartolini, MTarozzi, AMatera, RMilelli, AHrelia, PAndrisano, VBolognesi, MLMelchiorre, C Exploiting the lipoic acid structure in the search for novel multitarget ligands against Alzheimer's disease. Eur J Med Chem46:5435-42 (2011) 
 
Acetylcholinesterase
Name:Acetylcholinesterase
Type:Enzyme
Mol. Mass.:67792.70
Organism:Homo sapiens (Human)
Description:P22303
Residue:614
BDBM50355820
NameBDBM50355820
Synonyms:CHEMBL1912058
TypeSmall organic molecule
Emp. Form.C24H32ClN3OS2
Mol. Mass.478.113
SMILESClc1ccc2c(NCCCNC(=O)CCCC[C@H]3CCSS3)c3CCCCc3nc2c1