Reaction Details
TargetCholinesterase
LigandBDBM50355820
Substrate/Competitorn/a
Meas. Tech.ChEMBL_775053 (CHEMBL1912248)
IC50 12.1±n/a nM
Citation Rosini, MSimoni, EBartolini, MTarozzi, AMatera, RMilelli, AHrelia, PAndrisano, VBolognesi, MLMelchiorre, C Exploiting the lipoic acid structure in the search for novel multitarget ligands against Alzheimer's disease. Eur J Med Chem46:5435-42 (2011) 
 
Cholinesterase
Name:Cholinesterase
Type:Homotetramer
Mol. Mass.:68422.27
Organism:Homo sapiens (Human)
Description:P06276
Residue:602
BDBM50355820
NameBDBM50355820
Synonyms:CHEMBL1912058
TypeSmall organic molecule
Emp. Form.C24H32ClN3OS2
Mol. Mass.478.113
SMILESClc1ccc2c(NCCCNC(=O)CCCC[C@H]3CCSS3)c3CCCCc3nc2c1