Reaction Details
TargetDual specificity tyrosine-phosphorylation-regulated kinase 1A
LigandBDBM50355909
Substrate/Competitorn/a
Meas. Tech.ChEMBL_775906 (CHEMBL1912879)
IC50 60±n/a nM
Citation Kassis, PBrzeszcz, JBénéteau, VLozach, OMeijer, LLe Guével, RGuillouzo, CLewinski, KBourg, SColliandre, LRoutier, SMérour, JY Synthesis and biological evaluation of new 3-(6-hydroxyindol-2-yl)-5-(Phenyl) pyridine or pyrazine V-Shaped molecules as kinase inhibitors and cytotoxic agents. Eur J Med Chem46:5416-34 (2011) 
 
Dual specificity tyrosine-phosphorylation-regulated kinase 1A
Name:Dual specificity tyrosine-phosphorylation-regulated kinase 1A
Type:Enzyme Catalytic Domain
Mol. Mass.:85573.59
Organism:RAT
Description:Dual-specificity tyrosine-(Y)-phosphorylation regulated kinase 1A 0 RAT::Q63470
Residue:763
BDBM50355909
NameBDBM50355909
Synonyms:CHEMBL1910195
TypeSmall organic molecule
Emp. Form.C19H14N2O2
Mol. Mass.302.3267
SMILESOc1ccc(cc1)-c1cncc(c1)-c1cc2ccc(O)cc2[nH]1