Reaction Details
TargetGlucocorticoid receptor
LigandBDBM50356042
Substrate/Competitorn/a
Meas. Tech.ChEMBL_775646 (CHEMBL1913330)
IC50 30±n/a nM
Citation Betageri, RGilmore, TKuzmich, DKirrane, TMBentzien, JWiedenmayer, DBekkali, YRegan, JBerry, ALatli, BKukulka, AJFadra, TNNelson, RMGoldrick, SZuvela-Jelaska, LSouza, DPelletier, JDinallo, RPanzenbeck, MTorcellini, CLee, HPack, EHarcken, CNabozny, GThomson, DS Non-steroidal dissociated glucocorticoid agonists: indoles as A-ring mimetics and function-regulating pharmacophores. Bioorg Med Chem Lett21:6842-51 (2011) 
 
Glucocorticoid receptor
Name:Glucocorticoid receptor
Type:Enzyme
Mol. Mass.:85656.87
Organism:Homo sapiens (Human)
Description:P04150
Residue:777
BDBM50356042
NameBDBM50356042
Synonyms:CHEMBL1911548
TypeSmall organic molecule
Emp. Form.C23H25F4NO2
Mol. Mass.423.4437
SMILESCOc1ccc(F)cc1C(C)(C)CC(O)(Cc1cc2c(C)cccc2[nH]1)C(F)(F)F