Reaction Details
TargetGlucocorticoid receptor
LigandBDBM50356055
Substrate/Competitorn/a
Meas. Tech.ChEMBL_775646 (CHEMBL1913330)
IC50 19±n/a nM
Citation Betageri, RGilmore, TKuzmich, DKirrane, TMBentzien, JWiedenmayer, DBekkali, YRegan, JBerry, ALatli, BKukulka, AJFadra, TNNelson, RMGoldrick, SZuvela-Jelaska, LSouza, DPelletier, JDinallo, RPanzenbeck, MTorcellini, CLee, HPack, EHarcken, CNabozny, GThomson, DS Non-steroidal dissociated glucocorticoid agonists: indoles as A-ring mimetics and function-regulating pharmacophores. Bioorg Med Chem Lett21:6842-51 (2011) 
 
Glucocorticoid receptor
Name:Glucocorticoid receptor
Type:Enzyme
Mol. Mass.:85656.87
Organism:Homo sapiens (Human)
Description:P04150
Residue:777
BDBM50356055
NameBDBM50356055
Synonyms:CHEMBL1911655
TypeSmall organic molecule
Emp. Form.C23H24F3NO2
Mol. Mass.403.4374
SMILESCC(C)(CC(O)(Cc1cc2ccccc2[nH]1)C(F)(F)F)c1cccc2CCOc12