Reaction Details
TargetGlucocorticoid receptor
LigandBDBM50356061
Substrate/Competitorn/a
Meas. Tech.ChEMBL_775706 (CHEMBL1912091)
EC50 356±n/a nM
Citation Betageri, RGilmore, TKuzmich, DKirrane, TMBentzien, JWiedenmayer, DBekkali, YRegan, JBerry, ALatli, BKukulka, AJFadra, TNNelson, RMGoldrick, SZuvela-Jelaska, LSouza, DPelletier, JDinallo, RPanzenbeck, MTorcellini, CLee, HPack, EHarcken, CNabozny, GThomson, DS Non-steroidal dissociated glucocorticoid agonists: indoles as A-ring mimetics and function-regulating pharmacophores. Bioorg Med Chem Lett21:6842-51 (2011) 
 
Glucocorticoid receptor
Name:Glucocorticoid receptor
Type:Enzyme
Mol. Mass.:85656.87
Organism:Homo sapiens (Human)
Description:P04150
Residue:777
BDBM50356061
NameBDBM50356061
Synonyms:CHEMBL1911659
TypeSmall organic molecule
Emp. Form.C24H23F3N2O2
Mol. Mass.428.4468
SMILESCC(C)(CC(O)(Cc1cc2ccccc2[nH]1)C(F)(F)F)c1cc(cc2CCOc12)C#N