Reaction Details
TargetGlucocorticoid receptor
LigandBDBM50356060
Substrate/Competitorn/a
Meas. Tech.ChEMBL_775708 (CHEMBL1912093)
EC50>2000±n/a nM
Citation Betageri, RGilmore, TKuzmich, DKirrane, TMBentzien, JWiedenmayer, DBekkali, YRegan, JBerry, ALatli, BKukulka, AJFadra, TNNelson, RMGoldrick, SZuvela-Jelaska, LSouza, DPelletier, JDinallo, RPanzenbeck, MTorcellini, CLee, HPack, EHarcken, CNabozny, GThomson, DS Non-steroidal dissociated glucocorticoid agonists: indoles as A-ring mimetics and function-regulating pharmacophores. Bioorg Med Chem Lett21:6842-51 (2011) 
 
Glucocorticoid receptor
Name:Glucocorticoid receptor
Type:Enzyme
Mol. Mass.:85656.87
Organism:Homo sapiens (Human)
Description:P04150
Residue:777
BDBM50356060
NameBDBM50356060
Synonyms:CHEMBL1911664
TypeSmall organic molecule
Emp. Form.C25H25F3N2O4S
Mol. Mass.506.537
SMILESCC(C)(C[C@@](O)(Cc1cc2ccc(cc2[nH]1)C#N)C(F)(F)F)c1cc(cc2CCOc12)S(C)(=O)=O