Reaction Details
TargetGlucocorticoid receptor
LigandBDBM50356062
Substrate/Competitorn/a
Meas. Tech.ChEMBL_775652 (CHEMBL1913336)
IC50 100±n/a nM
Citation Betageri, RGilmore, TKuzmich, DKirrane, TMBentzien, JWiedenmayer, DBekkali, YRegan, JBerry, ALatli, BKukulka, AJFadra, TNNelson, RMGoldrick, SZuvela-Jelaska, LSouza, DPelletier, JDinallo, RPanzenbeck, MTorcellini, CLee, HPack, EHarcken, CNabozny, GThomson, DS Non-steroidal dissociated glucocorticoid agonists: indoles as A-ring mimetics and function-regulating pharmacophores. Bioorg Med Chem Lett21:6842-51 (2011) 
 
Glucocorticoid receptor
Name:Glucocorticoid receptor
Type:Enzyme
Mol. Mass.:85656.87
Organism:Homo sapiens (Human)
Description:P04150
Residue:777
BDBM50356062
NameBDBM50356062
Synonyms:CHEMBL1911660
TypeSmall organic molecule
Emp. Form.C24H26F3NO4S
Mol. Mass.481.528
SMILESCC(C)(CC(O)(Cc1cc2ccccc2[nH]1)C(F)(F)F)c1cc(cc2CCOc12)S(C)(=O)=O