Reaction Details
TargetCeramide glucosyltransferase
LigandBDBM50356075
Substrate/Competitorn/a
Meas. Tech.ChEMBL_775862 (CHEMBL1912403)
IC50 0.3±n/a nM
Citation Koltun, ERichards, SChan, VNachtigall, JDu, HNoson, KGalan, AAay, NHanel, AHarrison, AZhang, JWon, KATam, DQian, FWang, TFinn, POgilvie, KRosen, JMohan, RLarson, CLamb, PNuss, JKearney, P Discovery of a new class of glucosylceramide synthase inhibitors. Bioorg Med Chem Lett21:6773-7 (2011) 
 
Ceramide glucosyltransferase
Name:Ceramide glucosyltransferase
Type:PROTEIN
Mol. Mass.:44859.25
Organism:Homo sapiens (Human)
Description:ChEMBL_1435474
Residue:394
BDBM50356075
NameBDBM50356075
Synonyms:CHEMBL1911818
TypeSmall organic molecule
Emp. Form.C30H30ClF3N4O6
Mol. Mass.635.031
SMILESCN1CCN(CC1)C(=O)[C@@H](COCc1ccc2OCCOc2c1)NC(=O)c1cccnc1Oc1ccc(cc1Cl)C(F)(F)F