Reaction Details
TargetCeramide glucosyltransferase
LigandBDBM50356078
Substrate/Competitorn/a
Meas. Tech.ChEMBL_775861 (CHEMBL1912402)
IC50 2±n/a nM
Citation Koltun, ERichards, SChan, VNachtigall, JDu, HNoson, KGalan, AAay, NHanel, AHarrison, AZhang, JWon, KATam, DQian, FWang, TFinn, POgilvie, KRosen, JMohan, RLarson, CLamb, PNuss, JKearney, P Discovery of a new class of glucosylceramide synthase inhibitors. Bioorg Med Chem Lett21:6773-7 (2011) 
 
Ceramide glucosyltransferase
Name:Ceramide glucosyltransferase
Type:PROTEIN
Mol. Mass.:44859.25
Organism:Homo sapiens (Human)
Description:ChEMBL_1435474
Residue:394
BDBM50356078
NameBDBM50356078
Synonyms:CHEMBL1911815
TypeSmall organic molecule
Emp. Form.C27H28Cl2N4O4
Mol. Mass.543.442
SMILESCN1CCN(CC1)C(=O)[C@@H](COCc1ccccc1)NC(=O)c1cccnc1Oc1ccc(Cl)cc1Cl