Reaction Details
TargetCeramide glucosyltransferase
LigandBDBM50356094
Substrate/Competitorn/a
Meas. Tech.ChEMBL_775862 (CHEMBL1912403)
IC50 4±n/a nM
Citation Koltun, ERichards, SChan, VNachtigall, JDu, HNoson, KGalan, AAay, NHanel, AHarrison, AZhang, JWon, KATam, DQian, FWang, TFinn, POgilvie, KRosen, JMohan, RLarson, CLamb, PNuss, JKearney, P Discovery of a new class of glucosylceramide synthase inhibitors. Bioorg Med Chem Lett21:6773-7 (2011) 
 
Ceramide glucosyltransferase
Name:Ceramide glucosyltransferase
Type:PROTEIN
Mol. Mass.:44859.25
Organism:Homo sapiens (Human)
Description:ChEMBL_1435474
Residue:394
BDBM50356094
NameBDBM50356094
Synonyms:CHEMBL1911829
TypeSmall organic molecule
Emp. Form.C30H30ClF3N4O4
Mol. Mass.603.032
SMILESFC(F)(F)c1ccc(Oc2ncccc2C(=O)N[C@H](COCc2ccccc2)C(=O)N[C@@H]2CN3CCC2CC3)c(Cl)c1