Reaction Details
TargetCollagenase 3
LigandBDBM50356205
Substrate/Competitorn/a
Meas. Tech.ChEMBL_774908 (CHEMBL1913353)
IC50 7.1±n/a nM
Citation Hu, YXing, LThomason, JRXiang, JIpek, MGuler, SLi, HSabatini, JChockalingam, PReifenberg, ESheldon, RMorris, EAGeorgiadis, KETam, S Continued exploration of biphenylsulfonamide scaffold as a platform for aggrecanase-1 inhibition. Bioorg Med Chem Lett21:6800-3 (2011) 
 
Collagenase 3
Name:Collagenase 3
Type:Enzyme
Mol. Mass.:53808.06
Organism:Homo sapiens (Human)
Description:P45452
Residue:471
BDBM50356205
NameBDBM50356205
Synonyms:CHEMBL1910458
TypeSmall organic molecule
Emp. Form.C28H27NO5S
Mol. Mass.489.583
SMILESCC(C)[C@@H](NS(=O)(=O)c1ccc(cc1)-c1ccc(OCc2cccc3ccccc23)cc1)C(O)=O