Reaction Details
Target11-beta-hydroxysteroid dehydrogenase 1
LigandBDBM50202086
Substrate/Competitorn/a
Meas. Tech.ChEMBL_775369 (CHEMBL1912854)
Ki 8±n/a nM
Citation Ye, XYChen, SYNayeem, AGolla, RSeethala, RWang, MHarper, TSleczka, BGLi, YXHe, BKirby, MGordon, DARobl, JA Design, synthesis, and SAR studies of novel polycyclic acids as potent and selective inhibitors of human 11ß-hydroxysteroid dehydrogenase type 1 (11ß-HSD-1). Bioorg Med Chem Lett21:6699-704 (2011) 
 
11-beta-hydroxysteroid dehydrogenase 1
Name:11-beta-hydroxysteroid dehydrogenase 1
Type:Enzyme
Mol. Mass.:32409.16
Organism:Homo sapiens (Human)
Description:P28845
Residue:292
BDBM50202086
NameBDBM50202086
Synonyms:CHEMBL219142 | N-[(E)-5-hydroxy-2-adamantyl]-2-{4-[5-(trifluoromethyl)pyridin-2-yl]piperazin-1-yl}acetamide
TypeSmall organic molecule
Emp. Form.C22H29F3N4O2
Mol. Mass.438.4865
SMILESO[C@@]12CC3CC(C1)[C@H](NC(=O)CN1CCN(CC1)c1ccc(cn1)C(F)(F)F)C(C3)C2