Reaction Details
TargetNitric oxide synthase, inducible
LigandBDBM50356477
Substrate/Competitorn/a
Meas. Tech.ChEMBL_775891 (CHEMBL1912864)
EC50 6±n/a nM
Citation Gahman, TCHerbert, MRLang, HThayer, ASymons, KTNguyen, PMMassari, MEDozier, SZhang, YSablad, MRao, TSNoble, SAShiau, AKHassig, CA Identification and SAR of selective inducible nitric oxide synthase (iNOS) dimerization inhibitors. Bioorg Med Chem Lett21:6888-94 (2011) 
 
Nitric oxide synthase, inducible
Name:Nitric oxide synthase, inducible
Type:Homodimer
Mol. Mass.:131141.95
Organism:Homo sapiens (Human)
Description:P35228
Residue:1153
BDBM50356477
NameBDBM50356477
Synonyms:CHEMBL1911999
TypeSmall organic molecule
Emp. Form.C20H21N7O2S2
Mol. Mass.455.556
SMILESC(CNCc1ccc2OCOc2c1)CN(Cc1nccs1)c1nc(ns1)-n1ccnc1