Reaction Details
TargetNitric oxide synthase, inducible
LigandBDBM50356479
Substrate/Competitorn/a
Meas. Tech.ChEMBL_775891 (CHEMBL1912864)
EC50 9±n/a nM
Citation Gahman, TCHerbert, MRLang, HThayer, ASymons, KTNguyen, PMMassari, MEDozier, SZhang, YSablad, MRao, TSNoble, SAShiau, AKHassig, CA Identification and SAR of selective inducible nitric oxide synthase (iNOS) dimerization inhibitors. Bioorg Med Chem Lett21:6888-94 (2011) 
 
Nitric oxide synthase, inducible
Name:Nitric oxide synthase, inducible
Type:Homodimer
Mol. Mass.:131141.95
Organism:Homo sapiens (Human)
Description:P35228
Residue:1153
BDBM50356479
NameBDBM50356479
Synonyms:CHEMBL1911990
TypeSmall organic molecule
Emp. Form.C19H24N6O2S
Mol. Mass.400.498
SMILESCCCN(CCCNCc1ccc2OCOc2c1)c1nc(ns1)-n1ccnc1