Reaction Details
TargetNitric oxide synthase, inducible
LigandBDBM50356481
Substrate/Competitorn/a
Meas. Tech.ChEMBL_775891 (CHEMBL1912864)
EC50 12±n/a nM
Citation Gahman, TCHerbert, MRLang, HThayer, ASymons, KTNguyen, PMMassari, MEDozier, SZhang, YSablad, MRao, TSNoble, SAShiau, AKHassig, CA Identification and SAR of selective inducible nitric oxide synthase (iNOS) dimerization inhibitors. Bioorg Med Chem Lett21:6888-94 (2011) 
 
Nitric oxide synthase, inducible
Name:Nitric oxide synthase, inducible
Type:Homodimer
Mol. Mass.:131141.95
Organism:Homo sapiens (Human)
Description:P35228
Residue:1153
BDBM50356481
NameBDBM50356481
Synonyms:CHEMBL1909665
TypeSmall organic molecule
Emp. Form.C18H19N7O2S
Mol. Mass.397.454
SMILESN#CCN(CCCNCc1ccc2OCOc2c1)c1nc(ns1)-n1ccnc1