Reaction Details
TargetNitric oxide synthase, inducible
LigandBDBM50356488
Substrate/Competitorn/a
Meas. Tech.ChEMBL_775891 (CHEMBL1912864)
EC50 36±n/a nM
Citation Gahman, TCHerbert, MRLang, HThayer, ASymons, KTNguyen, PMMassari, MEDozier, SZhang, YSablad, MRao, TSNoble, SAShiau, AKHassig, CA Identification and SAR of selective inducible nitric oxide synthase (iNOS) dimerization inhibitors. Bioorg Med Chem Lett21:6888-94 (2011) 
 
Nitric oxide synthase, inducible
Name:Nitric oxide synthase, inducible
Type:Homodimer
Mol. Mass.:131141.95
Organism:Homo sapiens (Human)
Description:P35228
Residue:1153
BDBM50356488
NameBDBM50356488
Synonyms:CHEMBL1911987
TypeSmall organic molecule
Emp. Form.C22H24N6O3
Mol. Mass.420.4644
SMILESCc1cc(nc(n1)-n1ccnc1)C1CCCN1CC(=O)NCc1ccc2OCOc2c1