Reaction Details
TargetNitric oxide synthase, inducible
LigandBDBM50356504
Substrate/Competitorn/a
Meas. Tech.ChEMBL_775950 (CHEMBL1912693)
IC50 10±n/a nM
Citation Gahman, TCHerbert, MRLang, HThayer, ASymons, KTNguyen, PMMassari, MEDozier, SZhang, YSablad, MRao, TSNoble, SAShiau, AKHassig, CA Identification and SAR of selective inducible nitric oxide synthase (iNOS) dimerization inhibitors. Bioorg Med Chem Lett21:6888-94 (2011) 
 
Nitric oxide synthase, inducible
Name:Nitric oxide synthase, inducible
Type:Homodimer
Mol. Mass.:131141.95
Organism:Homo sapiens (Human)
Description:P35228
Residue:1153
BDBM50356504
NameBDBM50356504
Synonyms:CHEMBL1911883
TypeSmall organic molecule
Emp. Form.C20H24N6O2
Mol. Mass.380.4436
SMILESCN(CCCNCc1ccc2OCOc2c1)c1cc(C)nc(n1)-n1ccnc1