Reaction Details
TargetCannabinoid receptor 1
LigandBDBM50356553
Substrate/Competitorn/a
Meas. Tech.ChEMBL_776030 (CHEMBL1912500)
Ki 965.7±n/a nM
Citation Piscitelli, FLigresti, ALa Regina, GGatti, VBrizzi, APasquini, SAllarà, MCarai, MANovellino, EColombo, GDi Marzo, VCorelli, FSilvestri, R 1-Aryl-5-(1H-pyrrol-1-yl)-1H-pyrazole-3-carboxamide: an effective scaffold for the design of either CB1 or CB2 receptor ligands. Eur J Med Chem46:5641-53 (2011) 
 
Cannabinoid receptor 1
Name:Cannabinoid receptor 1
Type:G Protein-Coupled Receptor (GPCR)
Mol. Mass.:52868.96
Organism:Homo sapiens (Human)
Description:P21554
Residue:472
BDBM50356553
NameBDBM50356553
Synonyms:CHEMBL1909861
TypeSmall organic molecule
Emp. Form.C25H22Cl4N4O
Mol. Mass.536.28
SMILESCCc1c(nn(c1-n1c(C)ccc1C)-c1ccc(Cl)c(Cl)c1)C(=O)NCc1ccc(Cl)c(Cl)c1