Reaction Details
TargetCannabinoid receptor 2
LigandBDBM50356540
Substrate/Competitorn/a
Meas. Tech.ChEMBL_776031 (CHEMBL1912501)
Ki 376.4±n/a nM
Citation Piscitelli, FLigresti, ALa Regina, GGatti, VBrizzi, APasquini, SAllarà, MCarai, MANovellino, EColombo, GDi Marzo, VCorelli, FSilvestri, R 1-Aryl-5-(1H-pyrrol-1-yl)-1H-pyrazole-3-carboxamide: an effective scaffold for the design of either CB1 or CB2 receptor ligands. Eur J Med Chem46:5641-53 (2011) 
 
Cannabinoid receptor 2
Name:Cannabinoid receptor 2
Type:G Protein-Coupled Receptor (GPCR)
Mol. Mass.:39690.94
Organism:Homo sapiens (Human)
Description:P34972
Residue:360
BDBM50356540
NameBDBM50356540
Synonyms:CHEMBL1909848
TypeSmall organic molecule
Emp. Form.C25H28Cl2N4O
Mol. Mass.471.422
SMILESCc1c(nn(c1-n1cc2CCCCc2c1)-c1ccc(Cl)cc1Cl)C(=O)NC1CCCCC1