Reaction Details
TargetCannabinoid receptor 2
LigandBDBM50356544
Substrate/Competitorn/a
Meas. Tech.ChEMBL_776031 (CHEMBL1912501)
Ki 753.8±n/a nM
Citation Piscitelli, FLigresti, ALa Regina, GGatti, VBrizzi, APasquini, SAllarà, MCarai, MANovellino, EColombo, GDi Marzo, VCorelli, FSilvestri, R 1-Aryl-5-(1H-pyrrol-1-yl)-1H-pyrazole-3-carboxamide: an effective scaffold for the design of either CB1 or CB2 receptor ligands. Eur J Med Chem46:5641-53 (2011) 
 
Cannabinoid receptor 2
Name:Cannabinoid receptor 2
Type:G Protein-Coupled Receptor (GPCR)
Mol. Mass.:39690.94
Organism:Homo sapiens (Human)
Description:P34972
Residue:360
BDBM50356544
NameBDBM50356544
Synonyms:CHEMBL1909852
TypeSmall organic molecule
Emp. Form.C24H28Cl2N4O
Mol. Mass.459.411
SMILESCCc1c(nn(c1-n1c(C)ccc1C)-c1ccc(Cl)cc1Cl)C(=O)NC1CCCCC1