Reaction Details
TargetDipeptidyl peptidase 9
LigandBDBM50356588
Substrate/Competitorn/a
Meas. Tech.ChEMBL_776113 (CHEMBL1912809)
Ki 1536±n/a nM
Citation Wang, WDevasthale, PWang, AHarrity, TEgan, DMorgan, NCap, MFura, AKlei, HEKish, KWeigelt, CSun, LLevesque, PLi, YXZahler, RKirby, MSHamann, LG 7-Oxopyrrolopyridine-derived DPP4 inhibitors-mitigation of CYP and hERG liabilities via introduction of polar functionalities in the active site. Bioorg Med Chem Lett21:6646-51 (2011) 
 
Dipeptidyl peptidase 9
Name:Dipeptidyl peptidase 9
Type:Enzyme
Mol. Mass.:98260.70
Organism:Homo sapiens (Human)
Description:Q86TI2
Residue:863
BDBM50356588
NameBDBM50356588
Synonyms:CHEMBL1910120
TypeSmall organic molecule
Emp. Form.C23H25Cl2N5O3
Mol. Mass.490.382
SMILESCC(=O)N1CCN(CC1)C(=O)CN1Cc2c(nc(C)c(CN)c2-c2ccc(Cl)cc2Cl)C1=O