Reaction Details
TargetDipeptidyl peptidase 4
LigandBDBM50356593
Substrate/Competitorn/a
Meas. Tech.ChEMBL_776111 (CHEMBL1912807)
Ki 1.5±n/a nM
Citation Wang, WDevasthale, PWang, AHarrity, TEgan, DMorgan, NCap, MFura, AKlei, HEKish, KWeigelt, CSun, LLevesque, PLi, YXZahler, RKirby, MSHamann, LG 7-Oxopyrrolopyridine-derived DPP4 inhibitors-mitigation of CYP and hERG liabilities via introduction of polar functionalities in the active site. Bioorg Med Chem Lett21:6646-51 (2011) 
 
Dipeptidyl peptidase 4
Name:Dipeptidyl peptidase 4
Type:Enzyme
Mol. Mass.:88271.01
Organism:Homo sapiens (Human)
Description:P27487
Residue:766
BDBM50356593
NameBDBM50356593
Synonyms:CHEMBL1910115
TypeSmall organic molecule
Emp. Form.C17H16Cl2N4O2
Mol. Mass.379.241
SMILESCc1nc2C(=O)N(CC(N)=O)Cc2c(c1CN)-c1ccc(Cl)cc1Cl