Reaction Details
TargetHistamine H4 receptor
LigandBDBM50356794
Substrate/Competitorn/a
Meas. Tech.ChEMBL_786095 (CHEMBL1919838)
Ki 0.3±n/a nM
Citation Savall, BMGomez, LChavez, FCurtis, MMeduna, SPKearney, ADunford, PCowden, JThurmond, RLGrice, CEdwards, JP Tricyclic aminopyrimidine histamine H4 receptor antagonists. Bioorg Med Chem Lett21:6577-81 (2011) 
 
Histamine H4 receptor
Name:Histamine H4 receptor
Type:G Protein-Coupled Receptor (GPCR)
Mol. Mass.:44517.02
Organism:Homo sapiens (Human)
Description:Binding assays were using CHO cells stably expressing hH4R receptors.
Residue:390
BDBM50356794
NameBDBM50356794
Synonyms:CHEMBL1914462
TypeSmall organic molecule
Emp. Form.C15H16ClN5S
Mol. Mass.333.839
SMILESCN1CCN(CC1)c1nc(N)nc2c3cc(Cl)ccc3sc12