Reaction Details
TargetHistamine H4 receptor
LigandBDBM50356816
Substrate/Competitorn/a
Meas. Tech.ChEMBL_786095 (CHEMBL1919838)
Ki 2±n/a nM
Citation Savall, BMGomez, LChavez, FCurtis, MMeduna, SPKearney, ADunford, PCowden, JThurmond, RLGrice, CEdwards, JP Tricyclic aminopyrimidine histamine H4 receptor antagonists. Bioorg Med Chem Lett21:6577-81 (2011) 
 
Histamine H4 receptor
Name:Histamine H4 receptor
Type:G Protein-Coupled Receptor (GPCR)
Mol. Mass.:44517.02
Organism:Homo sapiens (Human)
Description:Binding assays were using CHO cells stably expressing hH4R receptors.
Residue:390
BDBM50356816
NameBDBM50356816
Synonyms:CHEMBL1914782
TypeSmall organic molecule
Emp. Form.C15H16FN5O
Mol. Mass.301.3188
SMILESCN[C@@H]1CCN(C1)c1nc(N)nc2c3cc(F)ccc3oc12