Reaction Details
TargetcAMP-specific 3',5'-cyclic phosphodiesterase 4B
LigandBDBM50357234
Substrate/Competitorn/a
Meas. Tech.ChEMBL_788290 (CHEMBL1919553)
IC50>2000±n/a nM
Citation Hughes, ROMaddux, TJoseph Rogier, DLu, SWalker, JKJon Jacobsen, ERumsey, JMZheng, YMacinnes, ABond, BRHan, S Investigation of the pyrazinones as PDE5 inhibitors: evaluation of regioisomeric projections into the solvent region. Bioorg Med Chem Lett21:6348-52 (2011) 
 
cAMP-specific 3',5'-cyclic phosphodiesterase 4B
Name:cAMP-specific 3',5'-cyclic phosphodiesterase 4B
Type:Protein
Mol. Mass.:83318.87
Organism:Homo sapiens (Human)
Description:Q07343
Residue:736
BDBM50357234
NameBDBM50357234
Synonyms:CHEMBL1916475
TypeSmall organic molecule
Emp. Form.C23H30N6O4
Mol. Mass.454.5221
SMILESCCCOCCn1c2cc(nnc2c(NC2CCC(O)CC2)nc1=O)-c1ccc(OC)nc1