Reaction Details
TargetSphingosine 1-phosphate receptor 1
LigandBDBM50357777
Substrate/Competitorn/a
Meas. Tech.ChEMBL_786287 (CHEMBL1920392)
EC50 54±n/a nM
Citation Buzard, DHan, SThoresen, LMoody, JLopez, LKawasaki, ASchrader, TSage, CGao, YEdwards, JBarden, JThatte, JFu, LSolomon, MLiu, LAl-Shamma, HGatlin, JLe, MXing, CEspinola, SJones, RM Discovery and characterization of potent and selective 4-oxo-4-(5-(5-phenyl-1,2,4-oxadiazol-3-yl)indolin-1-yl)butanoic acids as S1P¿? agonists. Bioorg Med Chem Lett21:6013-8 (2011) 
 
Sphingosine 1-phosphate receptor 1
Name:Sphingosine 1-phosphate receptor 1
Type:Enzyme
Mol. Mass.:42836.02
Organism:Homo sapiens (Human)
Description:P21453
Residue:382
BDBM50357777
NameBDBM50357777
Synonyms:CHEMBL1916555
TypeSmall organic molecule
Emp. Form.C21H15F6N3O4
Mol. Mass.487.3519
SMILESOC(=O)COc1ccc2CN(CCc2c1)c1noc(n1)-c1cc(cc(c1)C(F)(F)F)C(F)(F)F