Reaction Details
TargetSphingosine 1-phosphate receptor 4
LigandBDBM50357764
Substrate/Competitorn/a
Meas. Tech.ChEMBL_786296 (CHEMBL1920401)
EC50 1330±n/a nM
Citation Buzard, DHan, SThoresen, LMoody, JLopez, LKawasaki, ASchrader, TSage, CGao, YEdwards, JBarden, JThatte, JFu, LSolomon, MLiu, LAl-Shamma, HGatlin, JLe, MXing, CEspinola, SJones, RM Discovery and characterization of potent and selective 4-oxo-4-(5-(5-phenyl-1,2,4-oxadiazol-3-yl)indolin-1-yl)butanoic acids as S1P¿? agonists. Bioorg Med Chem Lett21:6013-8 (2011) 
 
Sphingosine 1-phosphate receptor 4
Name:Sphingosine 1-phosphate receptor 4
Type:G Protein-Coupled Receptor (GPCR)
Mol. Mass.:41647.39
Organism:Homo sapiens (Human)
Description:n/a
Residue:384
BDBM50357764
NameBDBM50357764
Synonyms:CHEMBL1916399
TypeSmall organic molecule
Emp. Form.C22H15F3N4O5
Mol. Mass.472.3735
SMILESOC(=O)CCC(=O)N1CCc2cc(ccc12)-c1noc(n1)-c1cc(OC(F)(F)F)cc(c1)C#N