Reaction Details
TargetCytochrome P450 2C19
LigandBDBM50357781
Substrate/Competitorn/a
Meas. Tech.ChEMBL_784918 (CHEMBL1920310)
IC50>50000±n/a nM
Citation Buzard, DHan, SThoresen, LMoody, JLopez, LKawasaki, ASchrader, TSage, CGao, YEdwards, JBarden, JThatte, JFu, LSolomon, MLiu, LAl-Shamma, HGatlin, JLe, MXing, CEspinola, SJones, RM Discovery and characterization of potent and selective 4-oxo-4-(5-(5-phenyl-1,2,4-oxadiazol-3-yl)indolin-1-yl)butanoic acids as S1P¿? agonists. Bioorg Med Chem Lett21:6013-8 (2011) 
 
Cytochrome P450 2C19
Name:Cytochrome P450 2C19
Type:Enzyme
Mol. Mass.:55935.47
Organism:Homo sapiens (Human)
Description:P33261
Residue:490
BDBM50357781
NameBDBM50357781
Synonyms:CHEMBL1916559
TypeSmall organic molecule
Emp. Form.C22H15F6N3O4
Mol. Mass.499.3626
SMILESOC(=O)CCC(=O)N1CCc2cc(ccc12)-c1noc(n1)-c1cc(cc(c1)C(F)(F)F)C(F)(F)F