Reaction Details
TargetcAMP and cAMP-inhibited cGMP 3',5'-cyclic phosphodiesterase 10A
LigandBDBM50357824
Substrate/Competitorn/a
Meas. Tech.ChEMBL_787236 (CHEMBL1918958)
IC50 1.9±n/a nM
Citation Malamas, MSNi, YErdei, JStange, HSchindler, RLankau, HJGrunwald, CFan, KYParris, KLangen, BEgerland, UHage, TMarquis, KLGrauer, SBrennan, JNavarra, RGraf, RHarrison, BLRobichaud, AKronbach, TPangalos, MNHoefgen, NBrandon, NJ Highly potent, selective, and orally active phosphodiesterase 10A inhibitors. J Med Chem54:7621-38 (2011) 
 
cAMP and cAMP-inhibited cGMP 3',5'-cyclic phosphodiesterase 10A
Name:cAMP and cAMP-inhibited cGMP 3',5'-cyclic phosphodiesterase 10A
Type:Protein
Mol. Mass.:88412.52
Organism:Homo sapiens (Human)
Description:Q9Y233
Residue:1055
BDBM50357824
NameBDBM50357824
Synonyms:CHEMBL1915890
TypeSmall organic molecule
Emp. Form.C18H15ClN4O
Mol. Mass.338.791
SMILESCOc1ccc2nc(C)c3c(C)nc(-c4ccccc4Cl)n3c2n1