Reaction Details
TargetcAMP and cAMP-inhibited cGMP 3',5'-cyclic phosphodiesterase 10A
LigandBDBM50357870
Substrate/Competitorn/a
Meas. Tech.ChEMBL_787236 (CHEMBL1918958)
IC50 0.090000±n/a nM
Citation Malamas, MSNi, YErdei, JStange, HSchindler, RLankau, HJGrunwald, CFan, KYParris, KLangen, BEgerland, UHage, TMarquis, KLGrauer, SBrennan, JNavarra, RGraf, RHarrison, BLRobichaud, AKronbach, TPangalos, MNHoefgen, NBrandon, NJ Highly potent, selective, and orally active phosphodiesterase 10A inhibitors. J Med Chem54:7621-38 (2011) 
 
cAMP and cAMP-inhibited cGMP 3',5'-cyclic phosphodiesterase 10A
Name:cAMP and cAMP-inhibited cGMP 3',5'-cyclic phosphodiesterase 10A
Type:Protein
Mol. Mass.:88412.52
Organism:Homo sapiens (Human)
Description:Q9Y233
Residue:1055
BDBM50357870
NameBDBM50357870
Synonyms:CHEMBL1916130
TypeSmall organic molecule
Emp. Form.C20H17F3N4O
Mol. Mass.386.3704
SMILESCOc1cc(cc2c1nc(C)c1c(C)nc(-c3ccncc3C)n21)C(F)(F)F