Reaction Details
TargetHigh affinity cAMP-specific and IBMX-insensitive 3',5'-cyclic phosphodiesterase 8A
LigandBDBM50357871
Substrate/Competitorn/a
Meas. Tech.ChEMBL_787244 (CHEMBL1918966)
IC50>1000±n/a nM
Citation Malamas, MSNi, YErdei, JStange, HSchindler, RLankau, HJGrunwald, CFan, KYParris, KLangen, BEgerland, UHage, TMarquis, KLGrauer, SBrennan, JNavarra, RGraf, RHarrison, BLRobichaud, AKronbach, TPangalos, MNHoefgen, NBrandon, NJ Highly potent, selective, and orally active phosphodiesterase 10A inhibitors. J Med Chem54:7621-38 (2011) 
 
High affinity cAMP-specific and IBMX-insensitive 3',5'-cyclic phosphodiesterase 8A
Name:High affinity cAMP-specific and IBMX-insensitive 3',5'-cyclic phosphodiesterase 8A
Type:Enzyme Catalytic Domain
Mol. Mass.:93295.89
Organism:Homo sapiens (Human)
Description:Recombinant catalytic domain (M1-E829) of human PDE8A.
Residue:829
BDBM50357871
NameBDBM50357871
Synonyms:CHEMBL1916131
TypeSmall organic molecule
Emp. Form.C19H17ClN4O
Mol. Mass.352.817
SMILESCOc1cc(Cl)c2nc(C)c3c(C)nc(-c4ccncc4C)n3c2c1