Reaction Details
TargetcAMP and cAMP-inhibited cGMP 3',5'-cyclic phosphodiesterase 10A
LigandBDBM50357875
Substrate/Competitorn/a
Meas. Tech.ChEMBL_787236 (CHEMBL1918958)
IC50 1.5±n/a nM
Citation Malamas, MSNi, YErdei, JStange, HSchindler, RLankau, HJGrunwald, CFan, KYParris, KLangen, BEgerland, UHage, TMarquis, KLGrauer, SBrennan, JNavarra, RGraf, RHarrison, BLRobichaud, AKronbach, TPangalos, MNHoefgen, NBrandon, NJ Highly potent, selective, and orally active phosphodiesterase 10A inhibitors. J Med Chem54:7621-38 (2011) 
 
cAMP and cAMP-inhibited cGMP 3',5'-cyclic phosphodiesterase 10A
Name:cAMP and cAMP-inhibited cGMP 3',5'-cyclic phosphodiesterase 10A
Type:Protein
Mol. Mass.:88412.52
Organism:Homo sapiens (Human)
Description:Q9Y233
Residue:1055
BDBM50357875
NameBDBM50357875
Synonyms:CHEMBL1916135
TypeSmall organic molecule
Emp. Form.C19H17FN4O
Mol. Mass.336.3629
SMILESCOc1cc(F)c2nc(C)c3c(C)nc(-c4cccnc4C)n3c2c1