Reaction Details
Target5-hydroxytryptamine receptor 1A
LigandBDBM50357975
Substrate/Competitorn/a
Meas. Tech.ChEMBL_787169 (CHEMBL1918839)
Ki 3.7±n/a nM
Citation Zajdel, PMarciniec, KMaslankiewicz, APaluchowska, MHSatala, GPartyka, AJastrzebska-Wiesek, MWróbel, DWesolowska, ADuszynska, BBojarski, AJPawlowski, M Arene- and quinoline-sulfonamides as novel 5-HT7 receptor ligands. Bioorg Med Chem19:6750-9 (2011) 
 
5-hydroxytryptamine receptor 1A
Name:5-hydroxytryptamine receptor 1A
Type:G Protein-Coupled Receptor (GPCR)
Mol. Mass.:46445.29
Organism:Rattus norvegicus (rat)
Description:Binding assays were performed using rat hippocampal membranes.
Residue:422
BDBM50357975
NameBDBM50357975
Synonyms:CHEMBL1917341
TypeSmall organic molecule
Emp. Form.C24H30N4O3S
Mol. Mass.454.585
SMILESCOc1ccccc1N1CCN(CCCCNS(=O)(=O)c2cnc3ccccc3c2)CC1