Reaction Details
TargetMu-type opioid receptor
LigandBDBM50026614
Substrate/Competitorn/a
Meas. Tech.ChEMBL_788808 (CHEMBL1924793)
Ki 31±n/a nM
Citation Mitch, CHQuimby, SJDiaz, NPedregal, Cde la Torre, MGJimenez, AShi, QCanada, EJKahl, SDStatnick, MAMcKinzie, DLBenesh, DRRash, KSBarth, VN Discovery of aminobenzyloxyarylamides as¿ opioid receptor selective antagonists: application to preclinical development of a¿ opioid receptor antagonist receptor occupancy tracer. J Med Chem54:8000-12 (2011) 
 
Mu-type opioid receptor
Name:Mu-type opioid receptor
Type:G Protein-Coupled Receptor (GPCR)
Mol. Mass.:44789.51
Organism:Homo sapiens (Human)
Description:P35372
Residue:400
BDBM50026614
NameBDBM50026614
Synonyms:CHEMBL575508
TypeSmall organic molecule
Emp. Form.C29H41N3O3
Mol. Mass.479.6541
SMILESCC(C)[C@@H](CN1CC[C@](C)([C@@H](C)C1)c1cccc(O)c1)NC(=O)[C@H]1Cc2ccc(O)cc2CN1C