Reaction Details
TargetDelta-type opioid receptor
LigandBDBM50219916
Substrate/Competitorn/a
Meas. Tech.ChEMBL_788809 (CHEMBL1924794)
Ki 28±n/a nM
Citation Mitch, CHQuimby, SJDiaz, NPedregal, Cde la Torre, MGJimenez, AShi, QCanada, EJKahl, SDStatnick, MAMcKinzie, DLBenesh, DRRash, KSBarth, VN Discovery of aminobenzyloxyarylamides as¿ opioid receptor selective antagonists: application to preclinical development of a¿ opioid receptor antagonist receptor occupancy tracer. J Med Chem54:8000-12 (2011) 
 
Delta-type opioid receptor
Name:Delta-type opioid receptor
Type:G Protein-Coupled Receptor (GPCR)
Mol. Mass.:40382.98
Organism:Homo sapiens (Human)
Description:Competition binding assays were carried out using membrane preparations from transfected HN9.10 cells that constitutively expressed the delta opioid receptor.
Residue:372
BDBM50219916
NameBDBM50219916
Synonyms:6-(4-((benzylamino)methyl)phenoxy)nicotinamide | CHEMBL238316
TypeSmall organic molecule
Emp. Form.C20H19N3O2
Mol. Mass.333.3838
SMILESNC(=O)c1ccc(Oc2ccc(CNCc3ccccc3)cc2)nc1