Reaction Details
TargetDelta-type opioid receptor
LigandBDBM50358168
Substrate/Competitorn/a
Meas. Tech.ChEMBL_788809 (CHEMBL1924794)
Ki 187±n/a nM
Citation Mitch, CHQuimby, SJDiaz, NPedregal, Cde la Torre, MGJimenez, AShi, QCanada, EJKahl, SDStatnick, MAMcKinzie, DLBenesh, DRRash, KSBarth, VN Discovery of aminobenzyloxyarylamides as¿ opioid receptor selective antagonists: application to preclinical development of a¿ opioid receptor antagonist receptor occupancy tracer. J Med Chem54:8000-12 (2011) 
 
Delta-type opioid receptor
Name:Delta-type opioid receptor
Type:G Protein-Coupled Receptor (GPCR)
Mol. Mass.:40382.98
Organism:Homo sapiens (Human)
Description:Competition binding assays were carried out using membrane preparations from transfected HN9.10 cells that constitutively expressed the delta opioid receptor.
Residue:372
BDBM50358168
NameBDBM50358168
Synonyms:CHEMBL1921844
TypeSmall organic molecule
Emp. Form.C24H22F2N2O2
Mol. Mass.408.4405
SMILESNC(=O)c1ccc(Oc2ccc(CN3CCCC3c3cccc(F)c3)cc2)c(F)c1