Reaction Details
TargetDelta-type opioid receptor
LigandBDBM50358161
Substrate/Competitorn/a
Meas. Tech.ChEMBL_788809 (CHEMBL1924794)
Ki>500±n/a nM
Citation Mitch, CHQuimby, SJDiaz, NPedregal, Cde la Torre, MGJimenez, AShi, QCanada, EJKahl, SDStatnick, MAMcKinzie, DLBenesh, DRRash, KSBarth, VN Discovery of aminobenzyloxyarylamides as¿ opioid receptor selective antagonists: application to preclinical development of a¿ opioid receptor antagonist receptor occupancy tracer. J Med Chem54:8000-12 (2011) 
 
Delta-type opioid receptor
Name:Delta-type opioid receptor
Type:G Protein-Coupled Receptor (GPCR)
Mol. Mass.:40382.98
Organism:Homo sapiens (Human)
Description:Competition binding assays were carried out using membrane preparations from transfected HN9.10 cells that constitutively expressed the delta opioid receptor.
Residue:372
BDBM50358161
NameBDBM50358161
Synonyms:CHEMBL1921850
TypeSmall organic molecule
Emp. Form.C24H25N3O2
Mol. Mass.387.4742
SMILESCC1(C)CN(Cc2ccc(Oc3ccc(cn3)C(N)=O)cc2)[C@@H]1c1ccccc1