Reaction Details
TargetMu-type opioid receptor
LigandBDBM50346474
Substrate/Competitorn/a
Meas. Tech.ChEMBL_788808 (CHEMBL1924793)
Ki 35±n/a nM
Citation Mitch, CHQuimby, SJDiaz, NPedregal, Cde la Torre, MGJimenez, AShi, QCanada, EJKahl, SDStatnick, MAMcKinzie, DLBenesh, DRRash, KSBarth, VN Discovery of aminobenzyloxyarylamides as¿ opioid receptor selective antagonists: application to preclinical development of a¿ opioid receptor antagonist receptor occupancy tracer. J Med Chem54:8000-12 (2011) 
 
Mu-type opioid receptor
Name:Mu-type opioid receptor
Type:G Protein-Coupled Receptor (GPCR)
Mol. Mass.:44789.51
Organism:Homo sapiens (Human)
Description:P35372
Residue:400
BDBM50346474
NameBDBM50346474
Synonyms:(R)-4-[2-(3,4-Dichloro-phenyl)-acetyl]-3-pyrrolidin-1-ylmethyl-piperazine-1-carboxylic acid methyl ester (R)-methyl4-(2-(3,4-dichlorophenyl)acetyl)-3-(pyrrolidin-1-ylmethyl)piperazine-1-carboxylate 4-[2-(3,4-Dichloro-phenyl)-acetyl]-3-pyrrolidin-1-ylmethyl-piperazine-1-carboxylic acid methyl ester CHEMBL277863 GR-89696
TypeSmall organic molecule
Emp. Form.C19H25Cl2N3O3
Mol. Mass.414.326
SMILESCOC(=O)N1CCN([C@H](CN2CCCC2)C1)C(=O)Cc1ccc(Cl)c(Cl)c1