Reaction Details
TargetKappa-type opioid receptor
LigandBDBM50219916
Substrate/Competitorn/a
Meas. Tech.ChEMBL_788807 (CHEMBL1924792)
Ki 1.8±n/a nM
Citation Mitch, CHQuimby, SJDiaz, NPedregal, Cde la Torre, MGJimenez, AShi, QCanada, EJKahl, SDStatnick, MAMcKinzie, DLBenesh, DRRash, KSBarth, VN Discovery of aminobenzyloxyarylamides as¿ opioid receptor selective antagonists: application to preclinical development of a¿ opioid receptor antagonist receptor occupancy tracer. J Med Chem54:8000-12 (2011) 
 
Kappa-type opioid receptor
Name:Kappa-type opioid receptor
Type:G Protein-Coupled Receptor (GPCR)
Mol. Mass.:42648.76
Organism:Homo sapiens (Human)
Description:P41145
Residue:380
BDBM50219916
NameBDBM50219916
Synonyms:6-(4-((benzylamino)methyl)phenoxy)nicotinamide | CHEMBL238316
TypeSmall organic molecule
Emp. Form.C20H19N3O2
Mol. Mass.333.3838
SMILESNC(=O)c1ccc(Oc2ccc(CNCc3ccccc3)cc2)nc1