Reaction Details
TargetCyclin-T1/Cyclin-dependent kinase 9
LigandBDBM50358210
Substrate/Competitorn/a
Meas. Tech.ChEMBL_790682 (CHEMBL1926135)
IC50 210±n/a nM
Citation Wilson, SCAtrash, BBarlow, CEccles, SFischer, PMHayes, AKelland, LJackson, WJarman, MMirza, AMoreno, JNutley, BPRaynaud, FISheldrake, PWalton, MWestwood, RWhittaker, SWorkman, PMcDonald, E Design, synthesis and biological evaluation of 6-pyridylmethylaminopurines as CDK inhibitors. Bioorg Med Chem19:6949-65 (2011) 
 
Cyclin-T1/Cyclin-dependent kinase 9
Name:Cyclin-T1/Cyclin-dependent kinase 9
Type:Protein Complex
Mol. Mass.:n/a
Description:n/a
Components:This complex has 2 components.
Component 1
Name:Cyclin-T1
Synonyms:CCNT1 CycT Cyclin T Cyclin-T
Type:Enzyme Subunit
Mol. Mass.:80712.40
Organism:Homo sapiens (Human)
Description:n/a
Residue:726
Component 2
Name:Cyclin-dependent kinase 9
Synonyms:C-2K CDK9 Cell division cycle 2-like protein kinase 4 Cyclin-Dependent Kinase 9 (CDK9) Serine/threonine-protein kinase PITALRE Tat-associated kinase complex catalytic subunit
Type:Enzyme Subunit
Mol. Mass.:42789.13
Organism:Homo sapiens (Human)
Description:n/a
Residue:372
BDBM50358210
NameBDBM50358210
Synonyms:CHEMBL1922123 | US8846696, (3R)-3-{9-Isopropyl-6-[(pyridin-3-ylmethyl)-amino]-9H-purin-2-ylamino}-2-methyl-pentan-2-ol
TypeSmall organic molecule
Emp. Form.C20H29N7O
Mol. Mass.383.4906
SMILESCC[C@@H](Nc1nc(NCc2cccnc2)c2ncn(C(C)C)c2n1)C(C)(C)O