Reaction Details
TargetCyclin-dependent kinase 7
LigandBDBM50358213
Substrate/Competitorn/a
Meas. Tech.ChEMBL_790695 (CHEMBL1926148)
IC50 1300±n/a nM
Citation Wilson, SCAtrash, BBarlow, CEccles, SFischer, PMHayes, AKelland, LJackson, WJarman, MMirza, AMoreno, JNutley, BPRaynaud, FISheldrake, PWalton, MWestwood, RWhittaker, SWorkman, PMcDonald, E Design, synthesis and biological evaluation of 6-pyridylmethylaminopurines as CDK inhibitors. Bioorg Med Chem19:6949-65 (2011) 
 
Cyclin-dependent kinase 7
Name:Cyclin-dependent kinase 7
Type:Enzyme Subunit
Mol. Mass.:39047.01
Organism:Homo sapiens (Human)
Description:n/a
Residue:346
BDBM50358213
NameBDBM50358213
Synonyms:CHEMBL1922219 | US8846696, (2R3S)-3-{9-Isopropyl-6-[(pyridin-3-ylmethyl)-amino]-9H-purin-2-ylamino}-pentan-2-ol
TypeSmall organic molecule
Emp. Form.C19H27N7O
Mol. Mass.369.464
SMILESCC[C@H](Nc1nc(NCc2cccnc2)c2ncn(C(C)C)c2n1)[C@@H](C)O